{"text_format":"1","workbook":"xlsx","n_sheets":13,"sheets":["notes","Options","Calcs","24VNA9_23","24VNA9_24","24VNA9_25","24VNA9_36","24VNA9_48","24VNA9_60","Form","Instructions","Prompt","Sheet1"],"not_rendered":{"charts":0,"images":7,"macros":1,"external_links":0,"defined_names":13,"comments":0,"pivot_tables":0},"unopened":[],"bounds":{"document_bytes":16777216,"sheet_cells":100000,"rows_first":2000,"rows_last":500,"rows_between":2000,"halvings":0,"cell_chars":16384,"cell_head_chars":4096},"cells_cut":0,"cells_raw":0,"read":"whole","date_system":"1900"}

{"sheet":"notes","index":0,"n_rows":65,"n_cols":16,"rows_kept":65,"cut":false,"hidden":true,"merged":[]}
[]
[null,null,null,null,null,null,null,{"$f":"SUM(H3:H8)","v":0}]
[null,null,600,24,600,1000,{"$f":"IF(Form!$D$4=D3,1,0)","v":0},{"$f":"IF(G3=1,IF(OR(E3>Form!M$5,F3<Form!M$5),1,0),0)","v":0}]
[null,null,800,30,800,1200,{"$f":"IF(Form!$D$4=D4,1,0)","v":0},{"$f":"IF(G4=1,IF(OR(E4>Form!M$5,F4<Form!M$5),1,0),0)","v":0}]
[null,null,1000,36,1000,1400,{"$f":"IF(Form!$D$4=D5,1,0)","v":0},{"$f":"IF(G5=1,IF(OR(E5>Form!M$5,F5<Form!M$5),1,0),0)","v":0}]
[null,null,1200,42,1200,1600,{"$f":"IF(Form!$D$4=D6,1,0)","v":0},{"$f":"IF(G6=1,IF(OR(E6>Form!M$5,F6<Form!M$5),1,0),0)","v":0}]
{"$rows_left_out":60}
{"sheet":"Options","index":1,"n_rows":1,"n_cols":1,"rows_kept":1,"cut":false,"hidden":true,"merged":[]}
["24VNA9"]

{"sheet":"Calcs","index":2,"n_rows":21,"n_cols":7,"rows_kept":21,"cut":false,"hidden":true,"merged":[[0,4,0,9],[1,4,1,9]]}
[null,null,null,"Condenser :  "]
[null,null,null,"ADP Evaporator:  "]
[null,null,null,"Condenser Entering Air Temperature: ",100,"(°F) Dry Bulb, 85°F to 115°F"]
[null,null,null,"Evaporator Air Flow:",1265,"CFM"]
[null,null,null,"Entering Evaporator Air (DB):  ",77.5,"(°F) Dry Bulb"]
[null,null,null,"Entering Evaporator Air (WB):  ",60.6,"(°F) Wet Bulb, 63°F to 71°F"]
{"$rows_left_out":16}
{"sheet":"24VNA9_23","index":3,"n_rows":19,"n_cols":45,"rows_kept":19,"cut":false,"hidden":true,"merged":[[2,0,2,1],[2,2,2,15],[3,2,3,3],[3,4,3,5],[3,6,3,7],[3,8,3,9],[3,10,3,11],[3,12,3,13],[3,14,3,15],[5,2,6,2],[5,3,6,3],[5,4,6,4],[5,5,6,5],[5,6,6,6],[5,7,6,7],[5,8,6,8],[4,0,6,0],[4,1,6,1],[4,2,4,3],[4,4,4,5],[4,6,4,7],[4,8,4,9],[5,9,6,9],[5,10,6,10],[5,11,6,11],[5,12,6,12],[5,13,6,13],[5,14,6,14],[5,15,6,15],[4,10,4,11],[4,12,4,13],[4,14,4,15],[41,4,41,15],[42,4,42,5],[42,6,42,7],[42,8,42,9],[42,10,42,11],[42,12,42,13],[42,14,42,15],[7,0,10,0],[11,0,14,0],[15,0,18,0],[31,0,34,0],[35,0,38,0],[41,0,42,1],[44,12,45,12],[44,13,45,13],[44,14,45,14],[44,15,45,15],[46,0,49,0],[50,0,53,0],[43,12,43,13],[43,14,43,15],[44,4,45,4],[44,5,45,5],[44,6,45,6],[44,7,45,7],[44,8,45,8],[44,9,45,9],[44,10,45,10],[44,11,45,11],[43,0,45,0],[43,1,45,1],[43,4,43,5],[43,6,43,7],[43,8,43,9],[43,10,43,11],[54,0,57,0],[60,0,61,1],[60,4,60,15],[61,4,61,5],[61,6,61,7],[61,8,61,9],[61,10,61,11],[61,12,61,13],[61,14,61,15],[63,12,64,12],[63,13,64,13],[63,14,64,14],[63,15,64,15],[65,0,68,0],[69,0,72,0],[62,12,62,13],[62,14,62,15],[63,4,64,4],[63,5,64,5],[63,6,64,6],[63,7,64,7],[63,8,64,8],[63,9,64,9],[63,10,64,10],[63,11,64,11],[62,0,64,0],[62,1,64,1],[62,4,62,5],[62,6,62,7],[62,8,62,9],[62,10,62,11],[73,0,76,0],[79,0,80,1],[79,4,79,15],[80,4,80,5],[80,6,80,7],[80,8,80,9],[80,10,80,11],[80,12,80,13],[80,14,80,15],[82,12,83,12],[82,13,83,13],[82,14,83,14],[82,15,83,15],[84,0,87,0],[88,0,91,0],[81,12,81,13],[81,14,81,15],[82,4,83,4],[82,5,83,5],[82,6,83,6],[82,7,83,7],[82,8,83,8],[82,9,83,9],[82,10,83,10],[82,11,83,11],[81,0,83,0],[81,1,83,1],[81,4,81,5],[81,6,81,7],[81,8,81,9],[81,10,81,11],[92,0,95,0],[98,0,99,1],[98,4,98,15],[99,4,99,5],[99,6,99,7],[99,8,99,9],[99,10,99,11],[99,12,99,13],[99,14,99,15],[101,12,102,12],[101,13,102,13],[101,14,102,14],[101,15,102,15],[103,0,106,0],[107,0,110,0],[100,12,100,13],[100,14,100,15],[101,4,102,4],[101,5,102,5],[101,6,102,6],[101,7,102,7],[101,8,102,8],[101,9,102,9],[101,10,102,10],[101,11,102,11],[100,0,102,0],[100,1,102,1],[100,4,100,5],[100,6,100,7],[100,8,100,9],[100,10,100,11],[111,0,114,0],[117,0,118,1],[117,4,117,15],[118,4,118,5],[118,6,118,7],[118,8,118,9],[118,10,118,11],[118,12,118,13],[118,14,118,15],[130,0,133,0],[120,12,121,12],[120,13,121,13],[120,14,121,14],[120,15,121,15],[122,0,125,0],[126,0,129,0],[119,12,119,13],[119,14,119,15],[120,4,121,4],[120,5,121,5],[120,6,121,6],[120,7,121,7],[120,8,121,8],[120,9,121,9],[120,10,121,10],[120,11,121,11],[119,0,121,0],[119,1,121,1],[119,4,119,5],[119,6,119,7],[119,8,119,9],[119,10,119,11]]}
[]
["24VNA9_23",null,"23=24A"]
["Evaporator Air Flow",null,"Condenser  Entering Air Temperature ˚F"]
[825,"CFM",65,null,75,null,85,null,95,null,100,null,105,null,115]
["Evap. Air °F DB","EWB†\n˚F","Capacity Mbtuh",null,"Capacity Mbtuh",null,"Capacity Mbtuh",null,"Capacity Mbtuh",null,"Capacity Mbtuh",null,"Capacity Mbtuh",null,"Capacity Mbtuh"]
[null,null,"Total","Sens.","Total","Sens.","Total","Sens.","Total","Sens.","Total","Sens.","Total","Sens.","Total","Sens."]
{"$rows_left_out":14}
{"sheet":"24VNA9_24","index":4,"n_rows":19,"n_cols":45,"rows_kept":19,"cut":false,"hidden":true,"merged":[[130,0,133,0],[120,12,121,12],[120,13,121,13],[120,14,121,14],[120,15,121,15],[122,0,125,0],[126,0,129,0],[119,12,119,13],[119,14,119,15],[120,4,121,4],[120,5,121,5],[120,6,121,6],[120,7,121,7],[120,8,121,8],[120,9,121,9],[120,10,121,10],[120,11,121,11],[119,0,121,0],[119,1,121,1],[119,4,119,5],[119,6,119,7],[119,8,119,9],[119,10,119,11],[111,0,114,0],[117,0,118,1],[117,4,117,15],[118,4,118,5],[118,6,118,7],[118,8,118,9],[118,10,118,11],[118,12,118,13],[118,14,118,15],[101,12,102,12],[101,13,102,13],[101,14,102,14],[101,15,102,15],[103,0,106,0],[107,0,110,0],[100,12,100,13],[100,14,100,15],[101,4,102,4],[101,5,102,5],[101,6,102,6],[101,7,102,7],[101,8,102,8],[101,9,102,9],[101,10,102,10],[101,11,102,11],[100,0,102,0],[100,1,102,1],[100,4,100,5],[100,6,100,7],[100,8,100,9],[100,10,100,11],[92,0,95,0],[98,0,99,1],[98,4,98,15],[99,4,99,5],[99,6,99,7],[99,8,99,9],[99,10,99,11],[99,12,99,13],[99,14,99,15],[82,12,83,12],[82,13,83,13],[82,14,83,14],[82,15,83,15],[84,0,87,0],[88,0,91,0],[81,12,81,13],[81,14,81,15],[82,4,83,4],[82,5,83,5],[82,6,83,6],[82,7,83,7],[82,8,83,8],[82,9,83,9],[82,10,83,10],[82,11,83,11],[81,0,83,0],[81,1,83,1],[81,4,81,5],[81,6,81,7],[81,8,81,9],[81,10,81,11],[73,0,76,0],[79,0,80,1],[79,4,79,15],[80,4,80,5],[80,6,80,7],[80,8,80,9],[80,10,80,11],[80,12,80,13],[80,14,80,15],[63,12,64,12],[63,13,64,13],[63,14,64,14],[63,15,64,15],[65,0,68,0],[69,0,72,0],[62,12,62,13],[62,14,62,15],[63,4,64,4],[63,5,64,5],[63,6,64,6],[63,7,64,7],[63,8,64,8],[63,9,64,9],[63,10,64,10],[63,11,64,11],[62,0,64,0],[62,1,64,1],[62,4,62,5],[62,6,62,7],[62,8,62,9],[62,10,62,11],[54,0,57,0],[60,0,61,1],[60,4,60,15],[61,4,61,5],[61,6,61,7],[61,8,61,9],[61,10,61,11],[61,12,61,13],[61,14,61,15],[44,12,45,12],[44,13,45,13],[44,14,45,14],[44,15,45,15],[46,0,49,0],[50,0,53,0],[43,12,43,13],[43,14,43,15],[44,4,45,4],[44,5,45,5],[44,6,45,6],[44,7,45,7],[44,8,45,8],[44,9,45,9],[44,10,45,10],[44,11,45,11],[43,0,45,0],[43,1,45,1],[43,4,43,5],[43,6,43,7],[43,8,43,9],[43,10,43,11],[41,4,41,15],[42,4,42,5],[42,6,42,7],[42,8,42,9],[42,10,42,11],[42,12,42,13],[42,14,42,15],[7,0,10,0],[11,0,14,0],[15,0,18,0],[31,0,34,0],[35,0,38,0],[41,0,42,1],[5,10,6,10],[5,11,6,11],[5,12,6,12],[5,13,6,13],[5,14,6,14],[5,15,6,15],[4,10,4,11],[4,12,4,13],[4,14,4,15],[5,2,6,2],[5,3,6,3],[5,4,6,4],[5,5,6,5],[5,6,6,6],[5,7,6,7],[5,8,6,8],[4,0,6,0],[4,1,6,1],[4,2,4,3],[4,4,4,5],[4,6,4,7],[4,8,4,9],[5,9,6,9],[2,0,2,1],[2,2,2,15],[3,2,3,3],[3,4,3,5],[3,6,3,7],[3,8,3,9],[3,10,3,11],[3,12,3,13],[3,14,3,15]]}
[]
["24VNA9_24",null,"24=24B"]
["Evaporator Air Flow",null,"Condenser  Entering Air Temperature ˚F"]
[825,"CFM",65,null,75,null,85,null,95,null,100,null,105,null,115]
["Evap. Air °F DB","EWB†\n˚F","Capacity Mbtuh",null,"Capacity Mbtuh",null,"Capacity Mbtuh",null,"Capacity Mbtuh",null,"Capacity Mbtuh",null,"Capacity Mbtuh",null,"Capacity Mbtuh"]
[null,null,"Total","Sens.","Total","Sens.","Total","Sens.","Total","Sens.","Total","Sens.","Total","Sens.","Total","Sens."]
{"$rows_left_out":14}
{"sheet":"24VNA9_25","index":5,"n_rows":19,"n_cols":45,"rows_kept":19,"cut":false,"hidden":true,"merged":[[130,0,133,0],[120,12,121,12],[120,13,121,13],[120,14,121,14],[120,15,121,15],[122,0,125,0],[126,0,129,0],[119,12,119,13],[119,14,119,15],[120,4,121,4],[120,5,121,5],[120,6,121,6],[120,7,121,7],[120,8,121,8],[120,9,121,9],[120,10,121,10],[120,11,121,11],[119,0,121,0],[119,1,121,1],[119,4,119,5],[119,6,119,7],[119,8,119,9],[119,10,119,11],[111,0,114,0],[117,0,118,1],[117,4,117,15],[118,4,118,5],[118,6,118,7],[118,8,118,9],[118,10,118,11],[118,12,118,13],[118,14,118,15],[101,12,102,12],[101,13,102,13],[101,14,102,14],[101,15,102,15],[103,0,106,0],[107,0,110,0],[100,12,100,13],[100,14,100,15],[101,4,102,4],[101,5,102,5],[101,6,102,6],[101,7,102,7],[101,8,102,8],[101,9,102,9],[101,10,102,10],[101,11,102,11],[100,0,102,0],[100,1,102,1],[100,4,100,5],[100,6,100,7],[100,8,100,9],[100,10,100,11],[92,0,95,0],[98,0,99,1],[98,4,98,15],[99,4,99,5],[99,6,99,7],[99,8,99,9],[99,10,99,11],[99,12,99,13],[99,14,99,15],[82,12,83,12],[82,13,83,13],[82,14,83,14],[82,15,83,15],[84,0,87,0],[88,0,91,0],[81,12,81,13],[81,14,81,15],[82,4,83,4],[82,5,83,5],[82,6,83,6],[82,7,83,7],[82,8,83,8],[82,9,83,9],[82,10,83,10],[82,11,83,11],[81,0,83,0],[81,1,83,1],[81,4,81,5],[81,6,81,7],[81,8,81,9],[81,10,81,11],[73,0,76,0],[79,0,80,1],[79,4,79,15],[80,4,80,5],[80,6,80,7],[80,8,80,9],[80,10,80,11],[80,12,80,13],[80,14,80,15],[63,12,64,12],[63,13,64,13],[63,14,64,14],[63,15,64,15],[65,0,68,0],[69,0,72,0],[62,12,62,13],[62,14,62,15],[63,4,64,4],[63,5,64,5],[63,6,64,6],[63,7,64,7],[63,8,64,8],[63,9,64,9],[63,10,64,10],[63,11,64,11],[62,0,64,0],[62,1,64,1],[62,4,62,5],[62,6,62,7],[62,8,62,9],[62,10,62,11],[54,0,57,0],[60,0,61,1],[60,4,60,15],[61,4,61,5],[61,6,61,7],[61,8,61,9],[61,10,61,11],[61,12,61,13],[61,14,61,15],[44,12,45,12],[44,13,45,13],[44,14,45,14],[44,15,45,15],[46,0,49,0],[50,0,53,0],[43,12,43,13],[43,14,43,15],[44,4,45,4],[44,5,45,5],[44,6,45,6],[44,7,45,7],[44,8,45,8],[44,9,45,9],[44,10,45,10],[44,11,45,11],[43,0,45,0],[43,1,45,1],[43,4,43,5],[43,6,43,7],[43,8,43,9],[43,10,43,11],[41,4,41,15],[42,4,42,5],[42,6,42,7],[42,8,42,9],[42,10,42,11],[42,12,42,13],[42,14,42,15],[7,0,10,0],[11,0,14,0],[15,0,18,0],[31,0,34,0],[35,0,38,0],[41,0,42,1],[5,10,6,10],[5,11,6,11],[5,12,6,12],[5,13,6,13],[5,14,6,14],[5,15,6,15],[4,10,4,11],[4,12,4,13],[4,14,4,15],[5,2,6,2],[5,3,6,3],[5,4,6,4],[5,5,6,5],[5,6,6,6],[5,7,6,7],[5,8,6,8],[4,0,6,0],[4,1,6,1],[4,2,4,3],[4,4,4,5],[4,6,4,7],[4,8,4,9],[5,9,6,9],[2,0,2,1],[2,2,2,15],[3,2,3,3],[3,4,3,5],[3,6,3,7],[3,8,3,9],[3,10,3,11],[3,12,3,13],[3,14,3,15]]}
[]
["24VNA9_25"]
["Evaporator Air Flow",null,"Condenser  Entering Air Temperature ˚F"]
[825,"CFM",65,null,75,null,85,null,95,null,100,null,105,null,115]
["Evap. Air °F DB","EWB†\n˚F","Capacity Mbtuh",null,"Capacity Mbtuh",null,"Capacity Mbtuh",null,"Capacity Mbtuh",null,"Capacity Mbtuh",null,"Capacity Mbtuh",null,"Capacity Mbtuh"]
[null,null,"Total","Sens.","Total","Sens.","Total","Sens.","Total","Sens.","Total","Sens.","Total","Sens.","Total","Sens."]
{"$rows_left_out":14}
{"sheet":"24VNA9_36","index":6,"n_rows":19,"n_cols":45,"rows_kept":19,"cut":false,"hidden":true,"merged":[[130,0,133,0],[120,12,121,12],[120,13,121,13],[120,14,121,14],[120,15,121,15],[122,0,125,0],[126,0,129,0],[119,12,119,13],[119,14,119,15],[120,4,121,4],[120,5,121,5],[120,6,121,6],[120,7,121,7],[120,8,121,8],[120,9,121,9],[120,10,121,10],[120,11,121,11],[119,0,121,0],[119,1,121,1],[119,4,119,5],[119,6,119,7],[119,8,119,9],[119,10,119,11],[111,0,114,0],[117,0,118,1],[117,4,117,15],[118,4,118,5],[118,6,118,7],[118,8,118,9],[118,10,118,11],[118,12,118,13],[118,14,118,15],[101,12,102,12],[101,13,102,13],[101,14,102,14],[101,15,102,15],[103,0,106,0],[107,0,110,0],[100,12,100,13],[100,14,100,15],[101,4,102,4],[101,5,102,5],[101,6,102,6],[101,7,102,7],[101,8,102,8],[101,9,102,9],[101,10,102,10],[101,11,102,11],[100,0,102,0],[100,1,102,1],[100,4,100,5],[100,6,100,7],[100,8,100,9],[100,10,100,11],[92,0,95,0],[98,0,99,1],[98,4,98,15],[99,4,99,5],[99,6,99,7],[99,8,99,9],[99,10,99,11],[99,12,99,13],[99,14,99,15],[82,12,83,12],[82,13,83,13],[82,14,83,14],[82,15,83,15],[84,0,87,0],[88,0,91,0],[81,12,81,13],[81,14,81,15],[82,4,83,4],[82,5,83,5],[82,6,83,6],[82,7,83,7],[82,8,83,8],[82,9,83,9],[82,10,83,10],[82,11,83,11],[81,0,83,0],[81,1,83,1],[81,4,81,5],[81,6,81,7],[81,8,81,9],[81,10,81,11],[73,0,76,0],[79,0,80,1],[79,4,79,15],[80,4,80,5],[80,6,80,7],[80,8,80,9],[80,10,80,11],[80,12,80,13],[80,14,80,15],[63,12,64,12],[63,13,64,13],[63,14,64,14],[63,15,64,15],[65,0,68,0],[69,0,72,0],[62,12,62,13],[62,14,62,15],[63,4,64,4],[63,5,64,5],[63,6,64,6],[63,7,64,7],[63,8,64,8],[63,9,64,9],[63,10,64,10],[63,11,64,11],[62,0,64,0],[62,1,64,1],[62,4,62,5],[62,6,62,7],[62,8,62,9],[62,10,62,11],[54,0,57,0],[60,0,61,1],[60,4,60,15],[61,4,61,5],[61,6,61,7],[61,8,61,9],[61,10,61,11],[61,12,61,13],[61,14,61,15],[44,12,45,12],[44,13,45,13],[44,14,45,14],[44,15,45,15],[46,0,49,0],[50,0,53,0],[43,12,43,13],[43,14,43,15],[44,4,45,4],[44,5,45,5],[44,6,45,6],[44,7,45,7],[44,8,45,8],[44,9,45,9],[44,10,45,10],[44,11,45,11],[43,0,45,0],[43,1,45,1],[43,4,43,5],[43,6,43,7],[43,8,43,9],[43,10,43,11],[41,4,41,15],[42,4,42,5],[42,6,42,7],[42,8,42,9],[42,10,42,11],[42,12,42,13],[42,14,42,15],[7,0,10,0],[11,0,14,0],[15,0,18,0],[31,0,34,0],[35,0,38,0],[41,0,42,1],[5,10,6,10],[5,11,6,11],[5,12,6,12],[5,13,6,13],[5,14,6,14],[5,15,6,15],[4,10,4,11],[4,12,4,13],[4,14,4,15],[5,2,6,2],[5,3,6,3],[5,4,6,4],[5,5,6,5],[5,6,6,6],[5,7,6,7],[5,8,6,8],[4,0,6,0],[4,1,6,1],[4,2,4,3],[4,4,4,5],[4,6,4,7],[4,8,4,9],[5,9,6,9],[2,0,2,1],[2,2,2,15],[3,2,3,3],[3,4,3,5],[3,6,3,7],[3,8,3,9],[3,10,3,11],[3,12,3,13],[3,14,3,15]]}
[]
["24VNA9_36"]
["Evaporator Air Flow",null,"Condenser  Entering Air Temperature ˚F"]
[1050,"CFM",65,null,75,null,85,null,95,null,100,null,105,null,115]
["Evap. Air °F DB","EWB†\n˚F","Capacity Mbtuh",null,"Capacity Mbtuh",null,"Capacity Mbtuh",null,"Capacity Mbtuh",null,"Capacity Mbtuh",null,"Capacity Mbtuh",null,"Capacity Mbtuh"]
[null,null,"Total","Sens.","Total","Sens.","Total","Sens.","Total","Sens.","Total","Sens.","Total","Sens.","Total","Sens."]
{"$rows_left_out":14}
{"sheet":"24VNA9_48","index":7,"n_rows":19,"n_cols":45,"rows_kept":19,"cut":false,"hidden":true,"merged":[[130,0,133,0],[120,12,121,12],[120,13,121,13],[120,14,121,14],[120,15,121,15],[122,0,125,0],[126,0,129,0],[119,12,119,13],[119,14,119,15],[120,4,121,4],[120,5,121,5],[120,6,121,6],[120,7,121,7],[120,8,121,8],[120,9,121,9],[120,10,121,10],[120,11,121,11],[119,0,121,0],[119,1,121,1],[119,4,119,5],[119,6,119,7],[119,8,119,9],[119,10,119,11],[111,0,114,0],[117,0,118,1],[117,4,117,15],[118,4,118,5],[118,6,118,7],[118,8,118,9],[118,10,118,11],[118,12,118,13],[118,14,118,15],[101,12,102,12],[101,13,102,13],[101,14,102,14],[101,15,102,15],[103,0,106,0],[107,0,110,0],[100,12,100,13],[100,14,100,15],[101,4,102,4],[101,5,102,5],[101,6,102,6],[101,7,102,7],[101,8,102,8],[101,9,102,9],[101,10,102,10],[101,11,102,11],[100,0,102,0],[100,1,102,1],[100,4,100,5],[100,6,100,7],[100,8,100,9],[100,10,100,11],[92,0,95,0],[98,0,99,1],[98,4,98,15],[99,4,99,5],[99,6,99,7],[99,8,99,9],[99,10,99,11],[99,12,99,13],[99,14,99,15],[82,12,83,12],[82,13,83,13],[82,14,83,14],[82,15,83,15],[84,0,87,0],[88,0,91,0],[81,12,81,13],[81,14,81,15],[82,4,83,4],[82,5,83,5],[82,6,83,6],[82,7,83,7],[82,8,83,8],[82,9,83,9],[82,10,83,10],[82,11,83,11],[81,0,83,0],[81,1,83,1],[81,4,81,5],[81,6,81,7],[81,8,81,9],[81,10,81,11],[73,0,76,0],[79,0,80,1],[79,4,79,15],[80,4,80,5],[80,6,80,7],[80,8,80,9],[80,10,80,11],[80,12,80,13],[80,14,80,15],[63,12,64,12],[63,13,64,13],[63,14,64,14],[63,15,64,15],[65,0,68,0],[69,0,72,0],[62,12,62,13],[62,14,62,15],[63,4,64,4],[63,5,64,5],[63,6,64,6],[63,7,64,7],[63,8,64,8],[63,9,64,9],[63,10,64,10],[63,11,64,11],[62,0,64,0],[62,1,64,1],[62,4,62,5],[62,6,62,7],[62,8,62,9],[62,10,62,11],[54,0,57,0],[60,0,61,1],[60,4,60,15],[61,4,61,5],[61,6,61,7],[61,8,61,9],[61,10,61,11],[61,12,61,13],[61,14,61,15],[44,12,45,12],[44,13,45,13],[44,14,45,14],[44,15,45,15],[46,0,49,0],[50,0,53,0],[43,12,43,13],[43,14,43,15],[44,4,45,4],[44,5,45,5],[44,6,45,6],[44,7,45,7],[44,8,45,8],[44,9,45,9],[44,10,45,10],[44,11,45,11],[43,0,45,0],[43,1,45,1],[43,4,43,5],[43,6,43,7],[43,8,43,9],[43,10,43,11],[41,4,41,15],[42,4,42,5],[42,6,42,7],[42,8,42,9],[42,10,42,11],[42,12,42,13],[42,14,42,15],[7,0,10,0],[11,0,14,0],[15,0,18,0],[31,0,34,0],[35,0,38,0],[41,0,42,1],[5,10,6,10],[5,11,6,11],[5,12,6,12],[5,13,6,13],[5,14,6,14],[5,15,6,15],[4,10,4,11],[4,12,4,13],[4,14,4,15],[5,2,6,2],[5,3,6,3],[5,4,6,4],[5,5,6,5],[5,6,6,6],[5,7,6,7],[5,8,6,8],[4,0,6,0],[4,1,6,1],[4,2,4,3],[4,4,4,5],[4,6,4,7],[4,8,4,9],[5,9,6,9],[2,0,2,1],[2,2,2,15],[3,2,3,3],[3,4,3,5],[3,6,3,7],[3,8,3,9],[3,10,3,11],[3,12,3,13],[3,14,3,15]]}
[]
["24VNA9_48"]
["Evaporator Air Flow",null,"Condenser  Entering Air Temperature ˚F"]
[1400,"CFM",65,null,75,null,85,null,95,null,100,null,105,null,115]
["Evap. Air °F DB","EWB†\n˚F","Capacity Mbtuh",null,"Capacity Mbtuh",null,"Capacity Mbtuh",null,"Capacity Mbtuh",null,"Capacity Mbtuh",null,"Capacity Mbtuh",null,"Capacity Mbtuh"]
[null,null,"Total","Sens.","Total","Sens.","Total","Sens.","Total","Sens.","Total","Sens.","Total","Sens.","Total","Sens."]
{"$rows_left_out":14}
{"sheet":"24VNA9_60","index":8,"n_rows":19,"n_cols":45,"rows_kept":19,"cut":false,"hidden":true,"merged":[[130,0,133,0],[120,12,121,12],[120,13,121,13],[120,14,121,14],[120,15,121,15],[122,0,125,0],[126,0,129,0],[119,12,119,13],[119,14,119,15],[120,4,121,4],[120,5,121,5],[120,6,121,6],[120,7,121,7],[120,8,121,8],[120,9,121,9],[120,10,121,10],[120,11,121,11],[119,0,121,0],[119,1,121,1],[119,4,119,5],[119,6,119,7],[119,8,119,9],[119,10,119,11],[111,0,114,0],[117,0,118,1],[117,4,117,15],[118,4,118,5],[118,6,118,7],[118,8,118,9],[118,10,118,11],[118,12,118,13],[118,14,118,15],[101,12,102,12],[101,13,102,13],[101,14,102,14],[101,15,102,15],[103,0,106,0],[107,0,110,0],[100,12,100,13],[100,14,100,15],[101,4,102,4],[101,5,102,5],[101,6,102,6],[101,7,102,7],[101,8,102,8],[101,9,102,9],[101,10,102,10],[101,11,102,11],[100,0,102,0],[100,1,102,1],[100,4,100,5],[100,6,100,7],[100,8,100,9],[100,10,100,11],[92,0,95,0],[98,0,99,1],[98,4,98,15],[99,4,99,5],[99,6,99,7],[99,8,99,9],[99,10,99,11],[99,12,99,13],[99,14,99,15],[82,12,83,12],[82,13,83,13],[82,14,83,14],[82,15,83,15],[84,0,87,0],[88,0,91,0],[81,12,81,13],[81,14,81,15],[82,4,83,4],[82,5,83,5],[82,6,83,6],[82,7,83,7],[82,8,83,8],[82,9,83,9],[82,10,83,10],[82,11,83,11],[81,0,83,0],[81,1,83,1],[81,4,81,5],[81,6,81,7],[81,8,81,9],[81,10,81,11],[73,0,76,0],[79,0,80,1],[79,4,79,15],[80,4,80,5],[80,6,80,7],[80,8,80,9],[80,10,80,11],[80,12,80,13],[80,14,80,15],[63,12,64,12],[63,13,64,13],[63,14,64,14],[63,15,64,15],[65,0,68,0],[69,0,72,0],[62,12,62,13],[62,14,62,15],[63,4,64,4],[63,5,64,5],[63,6,64,6],[63,7,64,7],[63,8,64,8],[63,9,64,9],[63,10,64,10],[63,11,64,11],[62,0,64,0],[62,1,64,1],[62,4,62,5],[62,6,62,7],[62,8,62,9],[62,10,62,11],[54,0,57,0],[60,0,61,1],[60,4,60,15],[61,4,61,5],[61,6,61,7],[61,8,61,9],[61,10,61,11],[61,12,61,13],[61,14,61,15],[44,12,45,12],[44,13,45,13],[44,14,45,14],[44,15,45,15],[46,0,49,0],[50,0,53,0],[43,12,43,13],[43,14,43,15],[44,4,45,4],[44,5,45,5],[44,6,45,6],[44,7,45,7],[44,8,45,8],[44,9,45,9],[44,10,45,10],[44,11,45,11],[43,0,45,0],[43,1,45,1],[43,4,43,5],[43,6,43,7],[43,8,43,9],[43,10,43,11],[41,4,41,15],[42,4,42,5],[42,6,42,7],[42,8,42,9],[42,10,42,11],[42,12,42,13],[42,14,42,15],[7,0,10,0],[11,0,14,0],[15,0,18,0],[31,0,34,0],[35,0,38,0],[41,0,42,1],[5,10,6,10],[5,11,6,11],[5,12,6,12],[5,13,6,13],[5,14,6,14],[5,15,6,15],[4,10,4,11],[4,12,4,13],[4,14,4,15],[5,2,6,2],[5,3,6,3],[5,4,6,4],[5,5,6,5],[5,6,6,6],[5,7,6,7],[5,8,6,8],[4,0,6,0],[4,1,6,1],[4,2,4,3],[4,4,4,5],[4,6,4,7],[4,8,4,9],[5,9,6,9],[2,0,2,1],[2,2,2,15],[3,2,3,3],[3,4,3,5],[3,6,3,7],[3,8,3,9],[3,10,3,11],[3,12,3,13],[3,14,3,15]]}
[]
["24VNA9_60"]
["Evaporator Air Flow",null,"Condenser  Entering Air Temperature ˚F"]
[1600,"CFM",65,null,75,null,85,null,95,null,100,null,105,null,115]
["Evap. Air °F DB","EWB†\n˚F","Capacity Mbtuh",null,"Capacity Mbtuh",null,"Capacity Mbtuh",null,"Capacity Mbtuh",null,"Capacity Mbtuh",null,"Capacity Mbtuh",null,"Capacity Mbtuh"]
[null,null,"Total","Sens.","Total","Sens.","Total","Sens.","Total","Sens.","Total","Sens.","Total","Sens.","Total","Sens."]
{"$rows_left_out":14}
{"sheet":"Form","index":9,"n_rows":53,"n_cols":17,"rows_kept":53,"cut":false,"hidden":true,"merged":[[28,15,29,15],[27,4,27,5],[34,0,37,0],[28,13,29,13],[28,10,29,10],[27,14,27,15],[28,14,29,14],[27,12,27,13],[28,4,29,4],[28,5,29,5],[28,6,29,6],[28,7,29,7],[30,0,33,0],[27,10,27,11],[28,12,29,12],[27,0,29,0],[28,11,29,11],[46,12,46,14],[38,0,41,0],[52,1,52,4],[28,2,29,2],[28,3,29,3],[28,9,29,9],[28,8,29,8],[27,1,29,1],[27,2,27,3],[27,6,27,7],[27,8,27,9],[1,3,1,8],[2,3,2,8],[13,0,13,15],[26,14,26,15],[26,10,26,11],[18,6,18,11],[26,4,26,5],[26,12,26,13],[26,8,26,9],[25,2,25,15],[25,0,25,1],[26,2,26,3],[17,6,17,11],[26,6,26,7],[1,10,1,12]]}
[]
[null,null,"Select Carrier Condenser:  ",null,null,null,null,null,null,null,"Efficiency Mode / Stage 5"]
[null,null,"ADP Evaporator:  ",null,null,null,null,null,null,null,null,null,null,24]
[null,null,"Nominal Capacity:  ",null,"(Mbtuh)","Note:  23 = 24A / 24 = 24B",null,null,null,null,null,"Condenser Entering Air Temperature: ",null,"(°F) Dry Bulb, 65°F to 115°F"]
[null,null,"AHRI Rated Capacity:  ",null,"(Mbtuh) @ 95 ˚F & 80/67 ˚F conditions",null,null,null,null,null,null,"Entering Evaporator Air (DB):  ",null,null,"to",null,"(°F) Dry Bulb -- 80°F Standard"]
[null,null,"Evaporator Air Flow (CFM): ","Fixed by OEM data",null,null,null,null,null,null,null,"Entering Evaporator Air (WB):  ",null,"(°F) Wet Bulb, 57°F to 72°F"]
{"$rows_left_out":48}
{"sheet":"Instructions","index":10,"n_rows":38,"n_cols":5,"rows_kept":38,"cut":false,"hidden":true,"merged":[]}
[]
[]
[]
[]
[]
[]
{"$rows_left_out":33}
{"sheet":"Prompt","index":11,"n_rows":17,"n_cols":2,"rows_kept":17,"cut":false,"hidden":false,"merged":[]}
[]
[]
[]
[]
[]
[null,"In order to use this spreadsheet, "]
{"$rows_left_out":12}
{"sheet":"Sheet1","index":12,"n_rows":0,"n_cols":0,"rows_kept":0,"cut":false,"hidden":true,"merged":[]}