{"text_format":"1","workbook":"xlsx","n_sheets":11,"sheets":["notes","Options","Calcs","PSA4BG_24","PSA4BG_36","PSA4BG_48","PSA4BG_60","Form","Instructions","Prompt","Sheet1"],"not_rendered":{"charts":0,"images":7,"macros":1,"external_links":0,"defined_names":7,"comments":0,"pivot_tables":0},"unopened":[],"bounds":{"document_bytes":16777216,"sheet_cells":100000,"rows_first":2000,"rows_last":500,"rows_between":2000,"halvings":0,"cell_chars":16384,"cell_head_chars":4096},"cells_cut":0,"cells_raw":0,"read":"whole","date_system":"1900"}

{"sheet":"notes","index":0,"n_rows":65,"n_cols":16,"rows_kept":65,"cut":false,"hidden":true,"merged":[]}
[]
[null,null,null,null,null,null,null,{"$f":"SUM(H3:H8)","v":0}]
[null,null,600,24,600,1000,{"$f":"IF(Form!$D$4=D3,1,0)","v":0},{"$f":"IF(G3=1,IF(OR(E3>Form!M$5,F3<Form!M$5),1,0),0)","v":0}]
[null,null,800,30,800,1200,{"$f":"IF(Form!$D$4=D4,1,0)","v":0},{"$f":"IF(G4=1,IF(OR(E4>Form!M$5,F4<Form!M$5),1,0),0)","v":0}]
[null,null,1000,36,1000,1400,{"$f":"IF(Form!$D$4=D5,1,0)","v":0},{"$f":"IF(G5=1,IF(OR(E5>Form!M$5,F5<Form!M$5),1,0),0)","v":0}]
[null,null,1200,42,1200,1600,{"$f":"IF(Form!$D$4=D6,1,0)","v":0},{"$f":"IF(G6=1,IF(OR(E6>Form!M$5,F6<Form!M$5),1,0),0)","v":0}]
[null,null,1400,48,1400,1800,{"$f":"IF(Form!$D$4=D7,1,0)","v":0},{"$f":"IF(G7=1,IF(OR(E7>Form!M$5,F7<Form!M$5),1,0),0)","v":0}]
[null,null,1600,60,1600,2000,{"$f":"IF(Form!$D$4=D8,1,0)","v":0},{"$f":"IF(G8=1,IF(OR(E8>Form!M$5,F8<Form!M$5),1,0),0)","v":0}]
{"$rows_left_out":58}
{"sheet":"Options","index":1,"n_rows":1,"n_cols":1,"rows_kept":1,"cut":false,"hidden":true,"merged":[]}
["PSA4BG"]

{"sheet":"Calcs","index":2,"n_rows":21,"n_cols":7,"rows_kept":21,"cut":false,"hidden":true,"merged":[[0,4,0,9],[1,4,1,9]]}
[null,null,null,"Condenser :  "]
[null,null,null,"ADP Evaporator:  "]
[null,null,null,"Condenser Entering Air Temperature: ",100,"(°F) Dry Bulb, 85°F to 115°F"]
[null,null,null,"Evaporator Air Flow:",1265,"CFM"]
[null,null,null,"Entering Evaporator Air (DB):  ",77.5,"(°F) Dry Bulb"]
[null,null,null,"Entering Evaporator Air (WB):  ",60.6,"(°F) Wet Bulb, 63°F to 71°F"]
[]
[]
{"$rows_left_out":14}
{"sheet":"PSA4BG_24","index":3,"n_rows":19,"n_cols":45,"rows_kept":19,"cut":false,"hidden":true,"merged":[[2,0,2,1],[2,2,2,15],[3,2,3,3],[3,4,3,5],[3,6,3,7],[3,8,3,9],[3,10,3,11],[3,12,3,13],[3,14,3,15],[5,2,6,2],[5,3,6,3],[5,4,6,4],[5,5,6,5],[5,6,6,6],[5,7,6,7],[5,8,6,8],[4,0,6,0],[4,1,6,1],[4,2,4,3],[4,4,4,5],[4,6,4,7],[4,8,4,9],[5,9,6,9],[5,10,6,10],[5,11,6,11],[5,12,6,12],[5,13,6,13],[5,14,6,14],[5,15,6,15],[4,10,4,11],[4,12,4,13],[4,14,4,15],[7,0,10,0],[11,0,14,0],[15,0,18,0],[22,4,22,15],[23,4,23,5],[23,6,23,7],[23,8,23,9],[23,10,23,11],[23,12,23,13],[23,14,23,15],[25,12,26,12],[25,13,26,13],[25,14,26,14],[25,15,26,15],[27,0,30,0],[31,0,34,0],[24,12,24,13],[24,14,24,15],[25,4,26,4],[25,5,26,5],[25,6,26,6],[25,7,26,7],[25,8,26,8],[25,9,26,9],[25,10,26,10],[25,11,26,11],[24,0,26,0],[24,1,26,1],[24,4,24,5],[24,6,24,7],[24,8,24,9],[24,10,24,11],[35,0,38,0],[41,0,42,1],[41,4,41,15],[42,4,42,5],[42,6,42,7],[42,8,42,9],[42,10,42,11],[42,12,42,13],[42,14,42,15],[44,12,45,12],[44,13,45,13],[44,14,45,14],[44,15,45,15],[46,0,49,0],[50,0,53,0],[43,12,43,13],[43,14,43,15],[44,4,45,4],[44,5,45,5],[44,6,45,6],[44,7,45,7],[44,8,45,8],[44,9,45,9],[44,10,45,10],[44,11,45,11],[43,0,45,0],[43,1,45,1],[43,4,43,5],[43,6,43,7],[43,8,43,9],[43,10,43,11],[54,0,57,0],[60,0,61,1],[60,4,60,15],[61,4,61,5],[61,6,61,7],[61,8,61,9],[61,10,61,11],[61,12,61,13],[61,14,61,15],[63,12,64,12],[63,13,64,13],[63,14,64,14],[63,15,64,15],[65,0,68,0],[69,0,72,0],[62,12,62,13],[62,14,62,15],[63,4,64,4],[63,5,64,5],[63,6,64,6],[63,7,64,7],[63,8,64,8],[63,9,64,9],[63,10,64,10],[63,11,64,11],[62,0,64,0],[62,1,64,1],[62,4,62,5],[62,6,62,7],[62,8,62,9],[62,10,62,11],[73,0,76,0],[79,0,80,1],[79,4,79,15],[80,4,80,5],[80,6,80,7],[80,8,80,9],[80,10,80,11],[80,12,80,13],[80,14,80,15],[82,12,83,12],[82,13,83,13],[82,14,83,14],[82,15,83,15],[84,0,87,0],[88,0,91,0],[81,12,81,13],[81,14,81,15],[82,4,83,4],[82,5,83,5],[82,6,83,6],[82,7,83,7],[82,8,83,8],[82,9,83,9],[82,10,83,10],[82,11,83,11],[81,0,83,0],[81,1,83,1],[81,4,81,5],[81,6,81,7],[81,8,81,9],[81,10,81,11],[92,0,95,0],[98,0,99,1],[98,4,98,15],[99,4,99,5],[99,6,99,7],[99,8,99,9],[99,10,99,11],[99,12,99,13],[99,14,99,15],[101,12,102,12],[101,13,102,13],[101,14,102,14],[101,15,102,15],[103,0,106,0],[107,0,110,0],[100,12,100,13],[100,14,100,15],[101,4,102,4],[101,5,102,5],[101,6,102,6],[101,7,102,7],[101,8,102,8],[101,9,102,9],[101,10,102,10],[101,11,102,11],[100,0,102,0],[100,1,102,1],[100,4,100,5],[100,6,100,7],[100,8,100,9],[100,10,100,11],[111,0,114,0],[117,0,118,1],[117,4,117,15],[118,4,118,5],[118,6,118,7],[118,8,118,9],[118,10,118,11],[118,12,118,13],[118,14,118,15],[130,0,133,0],[120,12,121,12],[120,13,121,13],[120,14,121,14],[120,15,121,15],[122,0,125,0],[126,0,129,0],[119,12,119,13],[119,14,119,15],[120,4,121,4],[120,5,121,5],[120,6,121,6],[120,7,121,7],[120,8,121,8],[120,9,121,9],[120,10,121,10],[120,11,121,11],[119,0,121,0],[119,1,121,1],[119,4,119,5],[119,6,119,7],[119,8,119,9],[119,10,119,11]]}
[]
["PSA4BG_24"]
["Evaporator Air \n",null,"Condenser  Entering Air Temperature ˚F"]
[80,"°F DB",65,null,75,null,85,null,95,null,100,null,105,null,115]
["CFM","EWB†\n˚F","Capacity Mbtuh",null,"Capacity Mbtuh",null,"Capacity Mbtuh",null,"Capacity Mbtuh",null,"Capacity Mbtuh",null,"Capacity Mbtuh",null,"Capacity Mbtuh"]
[null,null,"Total","Sens.","Total","Sens.","Total","Sens.","Total","Sens.","Total","Sens.","Total","Sens.","Total","Sens."]
[null,null,null,null,null,null,null,null,null,null,null,null,null,null,null,null,null,"Total Factors",null,null,null,null,null,null,"Sens. %",null,null,null,null,null,null,"IDB Adj",null,null,null,null,null,null,"Sens Calc"]
[700,72,{"$f":"R8*$I$14","v":29.544100801832762},{"$f":"IF(AM8>C8,C8,AM8)","v":14.313860252004581},{"$f":"S8*$I$14","v":28.416953035509735},{"$f":"IF(AN8>E8,E8,AN8)","v":13.809851088201603},{"$f":"T8*$I$14","v":27.179839633447877},{"$f":"IF(AO8>G8,G8,AO8)","v":13.333333333333332},{"$f":"U8*$I$14","v":25.832760595647194},{"$f":"IF(AP8>I8,I8,AP8)","v":12.865979381443298},{"$f":"V8*$I$14","v":25.09049255441008},{"$f":"IF(AQ8>K8,K8,AQ8)","v":12.627720504009162},{"$f":"W8*$I$14","v":24.348224513172966},{"$f":"IF(AR8>M8,M8,AR8)","v":12.389461626575029},{"$f":"X8*$I$14","v":22.707903780068726},{"$f":"IF(AS8>O8,O8,AS8)","v":11.876288659793813},null,1.231004200076365,1.1840397098129056,1.1324933180603283,1.0763650248186332,1.0454371897670867,1.0145093547155402,0.94616265750286366,0.48449131513647636,0.48597226701064172,0.49055967633175995,0.49804895352962036,0.50328707085463831,0.50884456153556645,0.52300242130750607,0.94857142857142862,0.91428571428571415,0.91428571428571415,0.91714285714285737,0.89999999999999958,0.88285714285714278,0.76571428571428557,{"$f":"Y8*C8+($A$4-80)*AF8*$A$8/1000","v":14.313860252004581},{"$f":"Z8*E8+($A$4-80)*AG8*$A$8/1000","v":13.809851088201603},{"$f":"AA8*G8+($A$4-80)*AH8*$A$8/1000","v":13.333333333333332},{"$f":"AB8*I8+($A$4-80)*AI8*$A$8/1000","v":12.865979381443298},{"$f":"AC8*K8+($A$4-80)*AJ8*$A$8/1000","v":12.627720504009162},{"$f":"AD8*M8+($A$4-80)*AK8*$A$8/1000","v":12.389461626575029},{"$f":"AE8*O8+($A$4-80)*AL8*$A$8/1000","v":11.876288659793813}]
{"$rows_left_out":12}
{"sheet":"PSA4BG_36","index":4,"n_rows":19,"n_cols":45,"rows_kept":19,"cut":false,"hidden":true,"merged":[[130,0,133,0],[120,12,121,12],[120,13,121,13],[120,14,121,14],[120,15,121,15],[122,0,125,0],[126,0,129,0],[119,12,119,13],[119,14,119,15],[120,4,121,4],[120,5,121,5],[120,6,121,6],[120,7,121,7],[120,8,121,8],[120,9,121,9],[120,10,121,10],[120,11,121,11],[119,0,121,0],[119,1,121,1],[119,4,119,5],[119,6,119,7],[119,8,119,9],[119,10,119,11],[111,0,114,0],[117,0,118,1],[117,4,117,15],[118,4,118,5],[118,6,118,7],[118,8,118,9],[118,10,118,11],[118,12,118,13],[118,14,118,15],[101,12,102,12],[101,13,102,13],[101,14,102,14],[101,15,102,15],[103,0,106,0],[107,0,110,0],[100,12,100,13],[100,14,100,15],[101,4,102,4],[101,5,102,5],[101,6,102,6],[101,7,102,7],[101,8,102,8],[101,9,102,9],[101,10,102,10],[101,11,102,11],[100,0,102,0],[100,1,102,1],[100,4,100,5],[100,6,100,7],[100,8,100,9],[100,10,100,11],[92,0,95,0],[98,0,99,1],[98,4,98,15],[99,4,99,5],[99,6,99,7],[99,8,99,9],[99,10,99,11],[99,12,99,13],[99,14,99,15],[82,12,83,12],[82,13,83,13],[82,14,83,14],[82,15,83,15],[84,0,87,0],[88,0,91,0],[81,12,81,13],[81,14,81,15],[82,4,83,4],[82,5,83,5],[82,6,83,6],[82,7,83,7],[82,8,83,8],[82,9,83,9],[82,10,83,10],[82,11,83,11],[81,0,83,0],[81,1,83,1],[81,4,81,5],[81,6,81,7],[81,8,81,9],[81,10,81,11],[73,0,76,0],[79,0,80,1],[79,4,79,15],[80,4,80,5],[80,6,80,7],[80,8,80,9],[80,10,80,11],[80,12,80,13],[80,14,80,15],[63,12,64,12],[63,13,64,13],[63,14,64,14],[63,15,64,15],[65,0,68,0],[69,0,72,0],[62,12,62,13],[62,14,62,15],[63,4,64,4],[63,5,64,5],[63,6,64,6],[63,7,64,7],[63,8,64,8],[63,9,64,9],[63,10,64,10],[63,11,64,11],[62,0,64,0],[62,1,64,1],[62,4,62,5],[62,6,62,7],[62,8,62,9],[62,10,62,11],[54,0,57,0],[60,0,61,1],[60,4,60,15],[61,4,61,5],[61,6,61,7],[61,8,61,9],[61,10,61,11],[61,12,61,13],[61,14,61,15],[44,12,45,12],[44,13,45,13],[44,14,45,14],[44,15,45,15],[46,0,49,0],[50,0,53,0],[43,12,43,13],[43,14,43,15],[44,4,45,4],[44,5,45,5],[44,6,45,6],[44,7,45,7],[44,8,45,8],[44,9,45,9],[44,10,45,10],[44,11,45,11],[43,0,45,0],[43,1,45,1],[43,4,43,5],[43,6,43,7],[43,8,43,9],[43,10,43,11],[35,0,38,0],[41,0,42,1],[41,4,41,15],[42,4,42,5],[42,6,42,7],[42,8,42,9],[42,10,42,11],[42,12,42,13],[42,14,42,15],[25,12,26,12],[25,13,26,13],[25,14,26,14],[25,15,26,15],[27,0,30,0],[31,0,34,0],[24,12,24,13],[24,14,24,15],[25,4,26,4],[25,5,26,5],[25,6,26,6],[25,7,26,7],[25,8,26,8],[25,9,26,9],[25,10,26,10],[25,11,26,11],[24,0,26,0],[24,1,26,1],[24,4,24,5],[24,6,24,7],[24,8,24,9],[24,10,24,11],[7,0,10,0],[11,0,14,0],[15,0,18,0],[22,4,22,15],[23,4,23,5],[23,6,23,7],[23,8,23,9],[23,10,23,11],[23,12,23,13],[23,14,23,15],[5,10,6,10],[5,11,6,11],[5,12,6,12],[5,13,6,13],[5,14,6,14],[5,15,6,15],[4,10,4,11],[4,12,4,13],[4,14,4,15],[5,2,6,2],[5,3,6,3],[5,4,6,4],[5,5,6,5],[5,6,6,6],[5,7,6,7],[5,8,6,8],[4,0,6,0],[4,1,6,1],[4,2,4,3],[4,4,4,5],[4,6,4,7],[4,8,4,9],[5,9,6,9],[2,0,2,1],[2,2,2,15],[3,2,3,3],[3,4,3,5],[3,6,3,7],[3,8,3,9],[3,10,3,11],[3,12,3,13],[3,14,3,15]]}
[]
["PSA4BG_36"]
["Evaporator Air \n",null,"Condenser  Entering Air Temperature ˚F"]
[80,"°F DB",65,null,75,null,85,null,95,null,100,null,105,null,115]
["CFM","EWB†\n˚F","Capacity Mbtuh",null,"Capacity Mbtuh",null,"Capacity Mbtuh",null,"Capacity Mbtuh",null,"Capacity Mbtuh",null,"Capacity Mbtuh",null,"Capacity Mbtuh"]
[null,null,"Total","Sens.","Total","Sens.","Total","Sens.","Total","Sens.","Total","Sens.","Total","Sens.","Total","Sens."]
[null,null,null,null,null,null,null,null,null,null,null,null,null,null,null,null,null,"Total Factors",null,null,null,null,null,null,"Sens. %",null,null,null,null,null,null,"IDB Adj",null,null,null,null,null,null,"Sens Calc"]
[940,72,{"$f":"R8*$I$14","v":27.82836951034831},{"$f":"IF(AM8>C8,C8,AM8)","v":13.550731953558811},{"$f":"S8*$I$14","v":27.985865724381625},{"$f":"IF(AN8>E8,E8,AN8)","v":13.459868753154971},{"$f":"T8*$I$14","v":27.137809187279153},{"$f":"IF(AO8>G8,G8,AO8)","v":13.017667844522968},{"$f":"U8*$I$14","v":25.756688541140843},{"$f":"IF(AP8>I8,I8,AP8)","v":12.448258455325595},{"$f":"V8*$I$14","v":25.04492680464412},{"$f":"IF(AQ8>K8,K8,AQ8)","v":12.20595658758203},{"$f":"W8*$I$14","v":24.333165068147402},{"$f":"IF(AR8>M8,M8,AR8)","v":11.963654719838466},{"$f":"X8*$I$14","v":23.345784957092377},{"$f":"IF(AS8>O8,O8,AS8)","v":11.781928319030794},null,1.1595153962645128,1.1660777385159011,1.1307420494699647,1.0731953558808685,1.0435386168601717,1.0138818778394751,0.97274103987884908,0.48693948628646067,0.48095238095238091,0.47968749999999999,0.48330197554092191,0.48736243802152618,0.49166044311675378,0.5046704722366373,1.0723404255319147,1.0638297872340425,1.0574468085106381,1.0510638297872337,1.0478723404255319,1.0446808510638297,1.0382978723404261,{"$f":"Y8*C8+($A$4-80)*AF8*$A$8/1000","v":13.550731953558811},{"$f":"Z8*E8+($A$4-80)*AG8*$A$8/1000","v":13.459868753154971},{"$f":"AA8*G8+($A$4-80)*AH8*$A$8/1000","v":13.017667844522968},{"$f":"AB8*I8+($A$4-80)*AI8*$A$8/1000","v":12.448258455325595},{"$f":"AC8*K8+($A$4-80)*AJ8*$A$8/1000","v":12.20595658758203},{"$f":"AD8*M8+($A$4-80)*AK8*$A$8/1000","v":11.963654719838466},{"$f":"AE8*O8+($A$4-80)*AL8*$A$8/1000","v":11.781928319030794}]
{"$rows_left_out":12}
{"sheet":"PSA4BG_48","index":5,"n_rows":19,"n_cols":45,"rows_kept":19,"cut":false,"hidden":true,"merged":[[130,0,133,0],[120,12,121,12],[120,13,121,13],[120,14,121,14],[120,15,121,15],[122,0,125,0],[126,0,129,0],[119,12,119,13],[119,14,119,15],[120,4,121,4],[120,5,121,5],[120,6,121,6],[120,7,121,7],[120,8,121,8],[120,9,121,9],[120,10,121,10],[120,11,121,11],[119,0,121,0],[119,1,121,1],[119,4,119,5],[119,6,119,7],[119,8,119,9],[119,10,119,11],[111,0,114,0],[117,0,118,1],[117,4,117,15],[118,4,118,5],[118,6,118,7],[118,8,118,9],[118,10,118,11],[118,12,118,13],[118,14,118,15],[101,12,102,12],[101,13,102,13],[101,14,102,14],[101,15,102,15],[103,0,106,0],[107,0,110,0],[100,12,100,13],[100,14,100,15],[101,4,102,4],[101,5,102,5],[101,6,102,6],[101,7,102,7],[101,8,102,8],[101,9,102,9],[101,10,102,10],[101,11,102,11],[100,0,102,0],[100,1,102,1],[100,4,100,5],[100,6,100,7],[100,8,100,9],[100,10,100,11],[92,0,95,0],[98,0,99,1],[98,4,98,15],[99,4,99,5],[99,6,99,7],[99,8,99,9],[99,10,99,11],[99,12,99,13],[99,14,99,15],[82,12,83,12],[82,13,83,13],[82,14,83,14],[82,15,83,15],[84,0,87,0],[88,0,91,0],[81,12,81,13],[81,14,81,15],[82,4,83,4],[82,5,83,5],[82,6,83,6],[82,7,83,7],[82,8,83,8],[82,9,83,9],[82,10,83,10],[82,11,83,11],[81,0,83,0],[81,1,83,1],[81,4,81,5],[81,6,81,7],[81,8,81,9],[81,10,81,11],[73,0,76,0],[79,0,80,1],[79,4,79,15],[80,4,80,5],[80,6,80,7],[80,8,80,9],[80,10,80,11],[80,12,80,13],[80,14,80,15],[63,12,64,12],[63,13,64,13],[63,14,64,14],[63,15,64,15],[65,0,68,0],[69,0,72,0],[62,12,62,13],[62,14,62,15],[63,4,64,4],[63,5,64,5],[63,6,64,6],[63,7,64,7],[63,8,64,8],[63,9,64,9],[63,10,64,10],[63,11,64,11],[62,0,64,0],[62,1,64,1],[62,4,62,5],[62,6,62,7],[62,8,62,9],[62,10,62,11],[54,0,57,0],[60,0,61,1],[60,4,60,15],[61,4,61,5],[61,6,61,7],[61,8,61,9],[61,10,61,11],[61,12,61,13],[61,14,61,15],[44,12,45,12],[44,13,45,13],[44,14,45,14],[44,15,45,15],[46,0,49,0],[50,0,53,0],[43,12,43,13],[43,14,43,15],[44,4,45,4],[44,5,45,5],[44,6,45,6],[44,7,45,7],[44,8,45,8],[44,9,45,9],[44,10,45,10],[44,11,45,11],[43,0,45,0],[43,1,45,1],[43,4,43,5],[43,6,43,7],[43,8,43,9],[43,10,43,11],[35,0,38,0],[41,0,42,1],[41,4,41,15],[42,4,42,5],[42,6,42,7],[42,8,42,9],[42,10,42,11],[42,12,42,13],[42,14,42,15],[25,12,26,12],[25,13,26,13],[25,14,26,14],[25,15,26,15],[27,0,30,0],[31,0,34,0],[24,12,24,13],[24,14,24,15],[25,4,26,4],[25,5,26,5],[25,6,26,6],[25,7,26,7],[25,8,26,8],[25,9,26,9],[25,10,26,10],[25,11,26,11],[24,0,26,0],[24,1,26,1],[24,4,24,5],[24,6,24,7],[24,8,24,9],[24,10,24,11],[7,0,10,0],[11,0,14,0],[15,0,18,0],[22,4,22,15],[23,4,23,5],[23,6,23,7],[23,8,23,9],[23,10,23,11],[23,12,23,13],[23,14,23,15],[5,10,6,10],[5,11,6,11],[5,12,6,12],[5,13,6,13],[5,14,6,14],[5,15,6,15],[4,10,4,11],[4,12,4,13],[4,14,4,15],[5,2,6,2],[5,3,6,3],[5,4,6,4],[5,5,6,5],[5,6,6,6],[5,7,6,7],[5,8,6,8],[4,0,6,0],[4,1,6,1],[4,2,4,3],[4,4,4,5],[4,6,4,7],[4,8,4,9],[5,9,6,9],[2,0,2,1],[2,2,2,15],[3,2,3,3],[3,4,3,5],[3,6,3,7],[3,8,3,9],[3,10,3,11],[3,12,3,13],[3,14,3,15]]}
[]
["PSA4BG_48"]
["Evaporator Air \n",null,"Condenser  Entering Air Temperature ˚F"]
[80,"°F DB",65,null,75,null,85,null,95,null,100,null,105,null,115]
["CFM","EWB†\n˚F","Capacity Mbtuh",null,"Capacity Mbtuh",null,"Capacity Mbtuh",null,"Capacity Mbtuh",null,"Capacity Mbtuh",null,"Capacity Mbtuh",null,"Capacity Mbtuh"]
[null,null,"Total","Sens.","Total","Sens.","Total","Sens.","Total","Sens.","Total","Sens.","Total","Sens.","Total","Sens."]
[null,null,null,null,null,null,null,null,null,null,null,null,null,null,null,null,null,"Total Factors",null,null,null,null,null,null,"Sens. %",null,null,null,null,null,null,"IDB Adj",null,null,null,null,null,null,"Sens Calc"]
[1285,72,{"$f":"R8*$I$14","v":27.434490696336084},{"$f":"IF(AM8>C8,C8,AM8)","v":13.595242662574334},{"$f":"S8*$I$14","v":28.009975062344139},{"$f":"IF(AN8>E8,E8,AN8)","v":13.618262037214654},{"$f":"T8*$I$14","v":26.969499328601572},{"$f":"IF(AO8>G8,G8,AO8)","v":13.065797045846919},{"$f":"U8*$I$14","v":25.427201227699975},{"$f":"IF(AP8>I8,I8,AP8)","v":12.471897180126604},{"$f":"V8*$I$14","v":24.964511797429498},{"$f":"IF(AQ8>K8,K8,AQ8)","v":12.4143487435258},{"$f":"W8*$I$14","v":24.501822367159026},{"$f":"IF(AR8>M8,M8,AR8)","v":12.356800306924995},{"$f":"X8*$I$14","v":19.741415691540382},{"$f":"IF(AS8>O8,O8,AS8)","v":10.377134087857279},null,1.1431037790140035,1.1670822942643391,1.1237291386917321,1.0594667178208323,1.0401879915595624,1.0209092652982927,0.82255898714751585,0.49555294512502096,0.48619329388560151,0.48446568794810513,0.4904942965779468,0.49727985246657452,0.50432168357760243,0.52565298507462677,1.0396887159533073,1.0708171206225672,1.1066147859922177,1.0583657587548634,0.94708171206225678,0.83579766536964939,0.85603112840466933,{"$f":"Y8*C8+($A$4-80)*AF8*$A$8/1000","v":13.595242662574334},{"$f":"Z8*E8+($A$4-80)*AG8*$A$8/1000","v":13.618262037214654},{"$f":"AA8*G8+($A$4-80)*AH8*$A$8/1000","v":13.065797045846919},{"$f":"AB8*I8+($A$4-80)*AI8*$A$8/1000","v":12.471897180126604},{"$f":"AC8*K8+($A$4-80)*AJ8*$A$8/1000","v":12.4143487435258},{"$f":"AD8*M8+($A$4-80)*AK8*$A$8/1000","v":12.356800306924995},{"$f":"AE8*O8+($A$4-80)*AL8*$A$8/1000","v":10.377134087857279}]
{"$rows_left_out":12}
{"sheet":"PSA4BG_60","index":6,"n_rows":19,"n_cols":45,"rows_kept":19,"cut":false,"hidden":true,"merged":[[130,0,133,0],[120,12,121,12],[120,13,121,13],[120,14,121,14],[120,15,121,15],[122,0,125,0],[126,0,129,0],[119,12,119,13],[119,14,119,15],[120,4,121,4],[120,5,121,5],[120,6,121,6],[120,7,121,7],[120,8,121,8],[120,9,121,9],[120,10,121,10],[120,11,121,11],[119,0,121,0],[119,1,121,1],[119,4,119,5],[119,6,119,7],[119,8,119,9],[119,10,119,11],[111,0,114,0],[117,0,118,1],[117,4,117,15],[118,4,118,5],[118,6,118,7],[118,8,118,9],[118,10,118,11],[118,12,118,13],[118,14,118,15],[101,12,102,12],[101,13,102,13],[101,14,102,14],[101,15,102,15],[103,0,106,0],[107,0,110,0],[100,12,100,13],[100,14,100,15],[101,4,102,4],[101,5,102,5],[101,6,102,6],[101,7,102,7],[101,8,102,8],[101,9,102,9],[101,10,102,10],[101,11,102,11],[100,0,102,0],[100,1,102,1],[100,4,100,5],[100,6,100,7],[100,8,100,9],[100,10,100,11],[92,0,95,0],[98,0,99,1],[98,4,98,15],[99,4,99,5],[99,6,99,7],[99,8,99,9],[99,10,99,11],[99,12,99,13],[99,14,99,15],[82,12,83,12],[82,13,83,13],[82,14,83,14],[82,15,83,15],[84,0,87,0],[88,0,91,0],[81,12,81,13],[81,14,81,15],[82,4,83,4],[82,5,83,5],[82,6,83,6],[82,7,83,7],[82,8,83,8],[82,9,83,9],[82,10,83,10],[82,11,83,11],[81,0,83,0],[81,1,83,1],[81,4,81,5],[81,6,81,7],[81,8,81,9],[81,10,81,11],[73,0,76,0],[79,0,80,1],[79,4,79,15],[80,4,80,5],[80,6,80,7],[80,8,80,9],[80,10,80,11],[80,12,80,13],[80,14,80,15],[63,12,64,12],[63,13,64,13],[63,14,64,14],[63,15,64,15],[65,0,68,0],[69,0,72,0],[62,12,62,13],[62,14,62,15],[63,4,64,4],[63,5,64,5],[63,6,64,6],[63,7,64,7],[63,8,64,8],[63,9,64,9],[63,10,64,10],[63,11,64,11],[62,0,64,0],[62,1,64,1],[62,4,62,5],[62,6,62,7],[62,8,62,9],[62,10,62,11],[54,0,57,0],[60,0,61,1],[60,4,60,15],[61,4,61,5],[61,6,61,7],[61,8,61,9],[61,10,61,11],[61,12,61,13],[61,14,61,15],[44,12,45,12],[44,13,45,13],[44,14,45,14],[44,15,45,15],[46,0,49,0],[50,0,53,0],[43,12,43,13],[43,14,43,15],[44,4,45,4],[44,5,45,5],[44,6,45,6],[44,7,45,7],[44,8,45,8],[44,9,45,9],[44,10,45,10],[44,11,45,11],[43,0,45,0],[43,1,45,1],[43,4,43,5],[43,6,43,7],[43,8,43,9],[43,10,43,11],[35,0,38,0],[41,0,42,1],[41,4,41,15],[42,4,42,5],[42,6,42,7],[42,8,42,9],[42,10,42,11],[42,12,42,13],[42,14,42,15],[25,12,26,12],[25,13,26,13],[25,14,26,14],[25,15,26,15],[27,0,30,0],[31,0,34,0],[24,12,24,13],[24,14,24,15],[25,4,26,4],[25,5,26,5],[25,6,26,6],[25,7,26,7],[25,8,26,8],[25,9,26,9],[25,10,26,10],[25,11,26,11],[24,0,26,0],[24,1,26,1],[24,4,24,5],[24,6,24,7],[24,8,24,9],[24,10,24,11],[7,0,10,0],[11,0,14,0],[15,0,18,0],[22,4,22,15],[23,4,23,5],[23,6,23,7],[23,8,23,9],[23,10,23,11],[23,12,23,13],[23,14,23,15],[5,10,6,10],[5,11,6,11],[5,12,6,12],[5,13,6,13],[5,14,6,14],[5,15,6,15],[4,10,4,11],[4,12,4,13],[4,14,4,15],[5,2,6,2],[5,3,6,3],[5,4,6,4],[5,5,6,5],[5,6,6,6],[5,7,6,7],[5,8,6,8],[4,0,6,0],[4,1,6,1],[4,2,4,3],[4,4,4,5],[4,6,4,7],[4,8,4,9],[5,9,6,9],[2,0,2,1],[2,2,2,15],[3,2,3,3],[3,4,3,5],[3,6,3,7],[3,8,3,9],[3,10,3,11],[3,12,3,13],[3,14,3,15]]}
[]
["PSA4BG_60"]
["Evaporator Air \n",null,"Condenser  Entering Air Temperature ˚F"]
[80,"°F DB",65,null,75,null,85,null,95,null,100,null,105,null,115]
["CFM","EWB†\n˚F","Capacity Mbtuh",null,"Capacity Mbtuh",null,"Capacity Mbtuh",null,"Capacity Mbtuh",null,"Capacity Mbtuh",null,"Capacity Mbtuh",null,"Capacity Mbtuh"]
[null,null,"Total","Sens.","Total","Sens.","Total","Sens.","Total","Sens.","Total","Sens.","Total","Sens.","Total","Sens."]
[null,null,null,null,null,null,null,null,null,null,null,null,null,null,null,null,null,"Total Factors",null,null,null,null,null,null,"Sens. %",null,null,null,null,null,null,"IDB Adj",null,null,null,null,null,null,"Sens Calc"]
[1480,72,{"$f":"R8*$I$14","v":27.590187590187593},{"$f":"IF(AM8>C8,C8,AM8)","v":14.183742183742186},{"$f":"S8*$I$14","v":27.617123617123617},{"$f":"IF(AN8>E8,E8,AN8)","v":13.956709956709959},{"$f":"T8*$I$14","v":26.901394901394902},{"$f":"IF(AO8>G8,G8,AO8)","v":13.444925444925445},{"$f":"U8*$I$14","v":25.685425685425685},{"$f":"IF(AP8>I8,I8,AP8)","v":12.767676767676768},{"$f":"V8*$I$14","v":24.944684944684944},{"$f":"IF(AQ8>K8,K8,AQ8)","v":12.402116402116404},{"$f":"W8*$I$14","v":24.203944203944204},{"$f":"IF(AR8>M8,M8,AR8)","v":12.036556036556037},{"$f":"X8*$I$14","v":22.695526695526695},{"$f":"IF(AS8>O8,O8,AS8)","v":11.359307359307358},null,1.1495911495911497,1.1507134840468174,1.1208914542247876,1.0702260702260702,1.0393618726952061,1.0084976751643417,0.94564694564694562,0.51408647140864716,0.50536435836700577,0.49978543842082679,0.49707865168539328,0.49718472811415354,0.49729729729729732,0.50050864699898268,1.1148648648648647,1.0702702702702704,1.0662162162162161,1.0797297297297299,1.082432432432433,1.0851351351351355,1.0554054054054058,{"$f":"Y8*C8+($A$4-80)*AF8*$A$8/1000","v":14.183742183742186},{"$f":"Z8*E8+($A$4-80)*AG8*$A$8/1000","v":13.956709956709959},{"$f":"AA8*G8+($A$4-80)*AH8*$A$8/1000","v":13.444925444925445},{"$f":"AB8*I8+($A$4-80)*AI8*$A$8/1000","v":12.767676767676768},{"$f":"AC8*K8+($A$4-80)*AJ8*$A$8/1000","v":12.402116402116404},{"$f":"AD8*M8+($A$4-80)*AK8*$A$8/1000","v":12.036556036556037},{"$f":"AE8*O8+($A$4-80)*AL8*$A$8/1000","v":11.359307359307358}]
{"$rows_left_out":12}
{"sheet":"Form","index":7,"n_rows":53,"n_cols":16,"rows_kept":53,"cut":false,"hidden":true,"merged":[[1,3,1,8],[2,3,2,8],[13,0,13,15],[26,14,26,15],[26,10,26,11],[18,6,18,11],[26,4,26,5],[26,12,26,13],[26,8,26,9],[25,2,25,15],[25,0,25,1],[26,2,26,3],[17,6,17,11],[26,6,26,7],[52,1,52,4],[28,2,29,2],[28,3,29,3],[28,9,29,9],[28,8,29,8],[27,1,29,1],[27,2,27,3],[27,6,27,7],[46,9,46,14],[38,0,41,0],[27,12,27,13],[28,4,29,4],[28,5,29,5],[28,6,29,6],[28,7,29,7],[30,0,33,0],[27,8,27,9],[27,10,27,11],[28,12,29,12],[27,0,29,0],[28,11,29,11],[28,15,29,15],[27,4,27,5],[34,0,37,0],[28,13,29,13],[28,10,29,10],[27,14,27,15],[28,14,29,14]]}
[]
[null,null,"Select Maytag Condenser:  ",null,null,null,null,null,null,"Second Stage (Boost Speed C5) Cooling"]
[null,null,"ADP Evaporator:  ",null,null,null,null,null,null,null,null,null,null,24]
[null,null,"Nominal Capacity:  ",null,"(Mbtuh)",null,null,null,null,null,null,"Condenser Entering Air Temperature: ",null,"(°F) Dry Bulb, 65°F to 115°F"]
[null,null,"AHRI Rated Capacity:  ",null,"(Mbtuh) @ 95 ˚F & 80/67 ˚F conditions",null,null,null,null,null,null,"Evaporator Air Flow (CFM): ",null,null,"to"]
[null,null,"Entering Evaporator Air (DB):  ",null,"(°F) Dry Bulb -- 80°F Standard",null,null,null,null,null,null,"Entering Evaporator Air (WB):  ",null,"(°F) Wet Bulb, 62°F to 72°F"]
[null,null,null,null,null,null,null,null,null,null,null,null,null,48]
[null,null,null,null,null,null,null,null,null,null,null,null,null,"CFM"]
{"$rows_left_out":46}
{"sheet":"Instructions","index":8,"n_rows":38,"n_cols":5,"rows_kept":38,"cut":false,"hidden":true,"merged":[]}
[]
[]
[]
[]
[]
[]
[null,"This spreadsheet generates capacity information for ADP rated matches at other than nominal conditions."]
[null,"The information is provided is not certified and is provided for engineering use only."]
{"$rows_left_out":31}
{"sheet":"Prompt","index":9,"n_rows":17,"n_cols":2,"rows_kept":17,"cut":false,"hidden":false,"merged":[]}
[]
[]
[]
[]
[]
[null,"In order to use this spreadsheet, "]
[null,"Please enable Macros in your security settings."]
[]
{"$rows_left_out":10}
{"sheet":"Sheet1","index":10,"n_rows":0,"n_cols":0,"rows_kept":0,"cut":false,"hidden":true,"merged":[]}